in CompilePrograms > vavoom

Compiling vavoom : status ~ok

check http://vavoom-engine.com/ and its download area for upstream version including the patch proposed below in comments
another error at building :
if g++  -I. -I.  -DAL_VERSION_1_1=1 -DHAVE_INTTYPES_H=1 -I/usr/include/SDL -D_GNU_SOURCE=1 -D_REENTRANT   -g -O2 -W -Wall -pthread -D_REENTRANT  -MT _____MAIN_EXE_-d_part.o -MD -MP -MF ".deps/_____MAIN_EXE_-d_part.Tpo" -c -o _____MAIN_EXE_-d_part.o `test -f 'd_part.cpp' || echo './'`d_part.cpp; \
	    then mv -f ".deps/_____MAIN_EXE_-d_part.Tpo" ".deps/_____MAIN_EXE_-d_part.Po"; else rm -f ".deps/_____MAIN_EXE_-d_part.Tpo"; exit 1; fi
d_local.h:414: error: previous declaration of ‘float xscaleshrink’ with ‘C++’ linkage
d_part.cpp:50: error: conflicts with new declaration with ‘C’ linkage
d_local.h:415: error: previous declaration of ‘float yscaleshrink’ with ‘C++’ linkage
d_part.cpp:51: error: conflicts with new declaration with ‘C’ linkage
make[2]: *** [_____MAIN_EXE_-d_part.o] Erreur 1
make[2]: quittant le répertoire « /data1/baud123/rpm/BUILD/vavoom-1.22.1/source »
make[1]: *** [all-recursive] Erreur 1
make[1]: quittant le répertoire « /data1/baud123/rpm/BUILD/vavoom-1.22.1/source »
make: *** [all-recursive] Erreur 1
erreur: Mauvais status de sortie pour /home/baud123/rpm/tmp/rpm-tmp.24759 (%build)


Erreur de construction de RPM:
	Mauvais status de sortie pour /home/baud123/rpm/tmp/rpm-tmp.24759 (%build)
Valid XHTML :: Valid CSS: :: Powered by WikkaWiki